3-Fluorovaline

Kovats' RI, non-polar column, isothermal

View large format table.

Column type Active phase Temperature (C) I Reference Comment
CapillaryBP-190.1021.Vlasáková, Tolman, et al., 199312. m/0.32 mm/0.25 μm, N2

References

Vlasáková, Tolman, et al., 1993
Vlasáková, V.; Tolman, V.; Zivný, K., Gas chromatographic separation of diastereoisomeric and enantiomeric forms of some fluorinated amino acids on glass capillary columns, J. Chromatogr., 1993, 639, 2, 273-279, https://doi.org/10.1016/0021-9673(93)80263-8 . [all data]