Anthra[1,2-b]benzo[d]thiophene

Lee's RI, non-polar column, temperature ramp

View large format table.

Column type Active phase I Reference Comment
CapillaryDB-5486.7Becker and Colmsjö, 199830. m/0.25 mm/0.25 μm, He, 110. C @ 1. min, 10. K/min, 325. C @ 5. min
CapillarySE-52488.45Vassilaros, Kong, et al., 198220. m/0.30 mm/0.25 μm, H2, 40. C @ 2. min, 4. K/min; Tend: 265. C

Lee's RI, non-polar column, custom temperature program

View large format table.

Column type Active phase I Reference Comment
CapillaryDB-5482.4Becker and Colmsjö, 199830. m/0.25 mm/0.25 μm, He; Program: 110C(1min) => 40C/min => 160C => 10C/min => 300C925min)
CapillaryDB-5481.0Becker and Colmsjö, 199830. m/0.25 mm/0.25 μm, He; Program: 35C(2min) => 25C/min => 160C => 3C/min => 300C(25min)

References

Becker and Colmsjö, 1998
Becker, G.; Colmsjö, A., Gas chromatography-atomic emission detection for quantification of polycyclic aromatic sulfur heterocycles, Anal. Chim. Acta., 1998, 376, 3, 265-272, https://doi.org/10.1016/S0003-2670(98)00546-7 . [all data]

Vassilaros, Kong, et al., 1982
Vassilaros, D.L.; Kong, R.C.; Later, D.W.; Lee, M.L., Linear retention index system for polycyclic aromatic compounds. Critical evaluation and additional indices, J. Chromatogr., 1982, 252, 1-20, https://doi.org/10.1016/S0021-9673(01)88394-1 . [all data]