4-(1-Propenyl)-2,6-dimethoxyphenol (trans-propenylsyringol)

Van Den Dool and Kratz RI, non-polar column, custom temperature program

View large format table.

Column type Active phase I Reference Comment
CapillaryLM-51708.5Ré-Poppi and Santiago-Silva, 200230. m/0.25 mm/0.25 μm, He; Program: 60C(2min) => 15C/min => 180C => 5C/min => 280C(5min)

References

Ré-Poppi and Santiago-Silva, 2002
Ré-Poppi, N.; Santiago-Silva, M.R., Identification of polycyclic aromatic hydrocarbons and methoxylated phenols in wood smoke emitted during production of charcoal, Chromatographia, 2002, 55, 7/8, 475-481, https://doi.org/10.1007/BF02492280 . [all data]