26-Methyl-octacosyl cyanide

Van Den Dool and Kratz RI, non-polar column, custom temperature program

View large format table.

Column type Active phase I Reference Comment
CapillaryBPX-53329.Schulz, 2001H2; Column length: 25. m; Program: not specified

References

Schulz, 2001
Schulz, S., Composition of the silk lipids of the spider Nephila clavipes, Lipids, 2001, 36, 6, 637-647, https://doi.org/10.1007/s11745-001-0768-7 . [all data]