benzo[2,3]fluorantheno[1,12-bcd]thiophene

Lee's RI, non-polar column, custom temperature program

View large format table.

Column type Active phase I Reference Comment
CapillarySPB-5507.5Thuss, Popp, et al., 200060. m/0.32 mm/0.10 μm, He; Program: A: 105 0C (2 min) 2.5 0C -> 230 0C 50 0C/min -> 305 0C (15 min) B: 95 0C (2 min) 3.8 0C/min -> 310 0C (5 min)

References

Thuss, Popp, et al., 2000
Thuss, U.; Popp, P.; Ehrlich, C.; Kalkoff, W.-D., Identification and quantification of thaarenes in the flue gas of lignite-fired domestic heating, J. Hi. Res. Chromatogr., 2000, 23, 7/8, 457-473, https://doi.org/10.1002/1521-4168(20000801)23:7/8<457::AID-JHRC457>3.0.CO;2-7 . [all data]