2-Propyl-2H-thiapyrane

Van Den Dool and Kratz RI, non-polar column, temperature ramp

View large format table.

Column type Active phase I Reference Comment
CapillaryCP Sil 8 CB1117.Elmore and Mottram, 200060. m/0.25 mm/0.25 μm, 60. C @ 2. min, 15. K/min; Tend: 280. C

Van Den Dool and Kratz RI, non-polar column, custom temperature program

View large format table.

Column type Active phase I Reference Comment
CapillaryCP Sil 8 CB1117.Elmore and Mottram, 200060. m/0.25 mm/0.25 μm; Program: not specified

Van Den Dool and Kratz RI, polar column, temperature ramp

View large format table.

Column type Active phase I Reference Comment
CapillaryBP-201487.Elmore and Mottram, 20004. K/min; Column length: 50. m; Column diameter: 0.32 mm; Tstart: 60. C; Tend: 280. C

References

Elmore and Mottram, 2000
Elmore, J.S.; Mottram, D.S., Formation of 2-alkyl-(2H)-thiapyrans and 2-Alkylthiophenes in cooked beef and lamb, J. Agric. Food Chem., 2000, 48, 6, 2420-2424, https://doi.org/10.1021/jf000124v . [all data]