N-cycloheptyl-N-methyl-benzamide

Kovats' RI, non-polar column, isothermal

View large format table.

Column type Active phase Temperature (C) I Reference Comment
CapillaryDB-1170.1978.72Antonovic, Mijin, et al., 200030. m/0.256 mm/0.25 μm, N2
CapillaryDB-1190.1989.84Antonovic, Mijin, et al., 200030. m/0.256 mm/0.25 μm, N2
CapillaryDB-5170.2004.92Antonovic, Mijin, et al., 200060. m/0.321 mm/0.25 μm, N2
CapillaryDB-5190.2016.25Antonovic, Mijin, et al., 200060. m/0.321 mm/0.25 μm, N2

Kovats' RI, polar column, isothermal

View large format table.

Column type Active phase Temperature (C) I Reference Comment
CapillaryDB-Wax170.2956.19Antonovic, Mijin, et al., 200030. m/0.234 mm/0.25 μm, N2
CapillaryDB-Wax190.2967.52Antonovic, Mijin, et al., 200030. m/0.234 mm/0.25 μm, N2
CapillaryDB-Wax210.2978.62Antonovic, Mijin, et al., 200030. m/0.234 mm/0.25 μm, N2

References

Antonovic, Mijin, et al., 2000
Antonovic, D.G.; Mijin, D.Z.; Petrovic, S.D.; Stojanovic, N.D.; Nikolic, A.D., Gas chromatographic retention indices for the N-methyl-N-substituted benzamides on capillary columns, Indian J. Chem., 2000, 39B, 694-699. [all data]