Phenyl-2-nitrophenylacetic acid, methyl ester

Kovats' RI, non-polar column, isothermal

View large format table.

Column type Active phase Temperature (C) I Reference Comment
CapillaryHP-5200.2077.Soják, Perjéssy, et al., 19988. m/0.32 mm/0.17 μm, He

References

Soják, Perjéssy, et al., 1998
Soják, L.; Perjéssy, A.; Kubinec, R.; Giumanini, A.G., CGC-FTIR characterization of mononitro and dinitro isomers from nitration mixtures of methyl arylacetates, Chem. Pap., 1998, 52, 1, 34-40. [all data]