2-(2-(2-(2-(2-(2-Isobutoxy-ethoxy)-ethoxy)-ethoxy)-ethoxy)-ethoxy)-ethoxy)-ethanol

Van Den Dool and Kratz RI, non-polar column, temperature ramp

Data compiled by: NIST Mass Spectrometry Data Center, William E. Wallace, director

Column type Capillary
Active phase DB-5
Column length (m) 20.
Carrier gas He
Substrate
Column diameter (mm) 0.25
Phase thickness (μm)
Tstart (C) 50.
Tend (C) 350.
Heat rate (K/min) 5.5
Initial hold (min)
Final hold (min)
I 2660.
ReferenceKomárek, Richter, et al., 1998
Comment MSDC-RI

References

Komárek, Richter, et al., 1998
Komárek, K.; Richter, P.; Hoffmann, J., Capillary gas chromatography of n-butyl and isobutyl-, n-amyl and isoamyl polyethylene glycol ethers and their derivatives, J. Chromatogr. A, 1998, 800, 2, 305-315, https://doi.org/10.1016/S0021-9673(97)01144-8 . [all data]