13-Hydroxy-heptadecanoic acid, methyl ester, tBDMS ether

Van Den Dool and Kratz RI, non-polar column, temperature ramp

View large format table.

Column type Active phase I Reference Comment
CapillaryMethyl Silicone2472.Chance, Gerhardt, et al., 199830. m/0.25 mm/0.25 μm, He, 80. C @ 4. min, 5. K/min; Tend: 340. C

References

Chance, Gerhardt, et al., 1998
Chance, D.L.; Gerhardt, K.O.; Mawhinney, T.P., Gas-liquid chromatography--mass spectrometry of hydroxy fatty acids as their methyl esters tert.-butyldimethylsilyl ethers, J. Chromatogr. A, 1998, 793, 1, 91-98, https://doi.org/10.1016/S0021-9673(97)00876-5 . [all data]