2-(2-(2-(2-nonyloxy-ethoxy)-ethoxy)-ethoxy)-ethanol, TMS

Van Den Dool and Kratz RI, non-polar column, temperature ramp

View large format table.

Column type Active phase I Reference Comment
CapillaryDB-52371.6Richter, Komarek, et al., 199720. m/0.25 mm/0.25 μm, He, 5.5 K/min; Tstart: 50. C; Tend: 350. C

References

Richter, Komarek, et al., 1997
Richter, P.; Komarek, K.; Reznicková, I., Identification of alkylpolyethylene glycols in the residues after biodegradation of their mixtures by CGC and previous derivatization, Folia Microbiol. (Prague), 1997, 42, 5, 517-520, https://doi.org/10.1007/BF02826565 . [all data]