2-[2-(2-{2-[2-(2-Diethylamino-ethox y)-ethoxy]-ethoxy}-ethoxy)-ethoxy]- ethanol

Van Den Dool and Kratz RI, non-polar column, temperature ramp

View large format table.

Column type Active phase I Reference Comment
CapillaryUltra-22282.Poskrobko, Wasilewski, et al., 1995Column length: 25. m; Column diameter: 0.32 mm; Tstart: 50. C; Tend: 260. C

References

Poskrobko, Wasilewski, et al., 1995
Poskrobko, J.; Wasilewski, J.; Dziwinski, E.; Poskrobko, H.; Milchert, E., By-products of alcohol ethyoxylation in the presence of triethylamine, Tenside, Surfactants, Deterg., 1995, 32, 4, 351-354. [all data]