Vanadyl octaethylporphyrin

Normal alkane RI, non-polar column, temperature ramp

View large format table.

Column type Active phase I Reference Comment
CapillaryHT-56280.Pretorius, Ebdon, et al., 199310. m/0.32 mm/0.1 μm, He, 15. K/min, 410. C @ 10. min; Tstart: 60. C

References

Pretorius, Ebdon, et al., 1993
Pretorius, W.G.; Ebdon, L.; Rowland, S.J., Development of a high-temperature gas chromatography-inductively coupled plasma mass spectrometry interface for the determination of metalloporphyrins, J. Chromatogr., 1993, 646, 2, 369-375, https://doi.org/10.1016/0021-9673(93)83350-2 . [all data]