4-methyl-2-tert-butyl-6-hydroperoxymethyl-phenol

Kovats' RI, non-polar column, isothermal

View large format table.

Column type Active phase Temperature (C) I Reference Comment
PackedSE-30250.1614.Verevkin, Nesterov, et al., 1990He, NAWHMDS; Column length: 3. m

References

Verevkin, Nesterov, et al., 1990
Verevkin, S.P.; Nesterov, O.A.; Rempel, P.D.; Synkova, N.V.; Shashkin, N.P., Chromatographic determination of the products of condensation of alkylphenols with formic aldehyde, Zh. Anal. Khim., 1990, 43, 760-761. [all data]