2,12-Dimethylheptacosane

Kovats' RI, non-polar column, isothermal

View large format table.

Column type Active phase Temperature (C) I Reference Comment
CapillaryMethyl Silicone225.2794.Pomonis, Hakk, et al., 1989He; Column length: 12.5 m

References

Pomonis, Hakk, et al., 1989
Pomonis, J.G.; Hakk, H.; Fatland, C.L., Synthetic methyl- and dimethylalkanes. Kovats indices [13C]NMR and mass spectra of some methylpentacosanes and 2,X-dimethylheptacosanes, J. Chem. Ecol., 1989, 15, 9, 2319-2333. [all data]