Phenylethanolamine, N-methyl, N-DTFMB-TMS

Normal alkane RI, non-polar column, temperature ramp

View large format table.

Column type Active phase I Reference Comment
CapillaryMethyl Silicone1966.Midgley, MacLachlan, et al., 1988He, 100. C @ 1. min, 20. K/min; Column length: 12.5 m; Column diameter: 0.20 mm; Tend: 280. C

References

Midgley, MacLachlan, et al., 1988
Midgley, J.M.; MacLachlan, J.; Watson, D.G., An extraction-derivatization method suitable for the analysis of biogenic amines by gas chromatography negative ion mass spectrometry, Biomed. Environ. Mass Spectrom., 1988, 15, 10, 535-539, https://doi.org/10.1002/bms.1200151005 . [all data]