(4-pentoxy-phenyl)-acetic acid, methyl ester

Kovats' RI, non-polar column, isothermal

View large format table.

Column type Active phase Temperature (C) I Reference Comment
PackedApolane190.1770.Kuchar, Tomková, et al., 1985He, Chromosorb W HP; Column length: 1. m

References

Kuchar, Tomková, et al., 1985
Kuchar, Ml; Tomková, H.; Rejholec, V.; Skalická, O., Relationships between gas-liquid chromatographic behaviour and structure of arylaliphatic acids, J. Chromatogr., 1985, 333, 21-28, https://doi.org/10.1016/S0021-9673(01)87321-0 . [all data]