E-3-Chloro-2-methyl-prop-2-en-1-ol

Kovats' RI, non-polar column, isothermal

View large format table.

Column type Active phase Temperature (C) I Reference Comment
CapillaryOV-160.770.7Priboth, Engewald, et al., 1984Column length: 33. m; Column diameter: 0.3 mm

Kovats' RI, polar column, isothermal

View large format table.

Column type Active phase Temperature (C) I Reference Comment
CapillaryCarbowax 20M100.1650.7Priboth, Engewald, et al., 1984Column length: 50. m; Column diameter: 0.23 mm

References

Priboth, Engewald, et al., 1984
Priboth, I.; Engewald, W.; Schulze, K.; Schulze, B., Gas chromatographic retention behaviour of Z/E-isomeric chloroallyl and chlorovinyl compounds, J. Chromatogr., 1984, 294, 334-338, https://doi.org/10.1016/S0021-9673(01)96139-4 . [all data]