3',4'-Dichlorobutyroanilide

Kovats' RI, non-polar column, isothermal

Data compiled by: NIST Mass Spectrometry Data Center, William E. Wallace, director

Column type Packed
Active phase SE-30
Column length (m) 1.
Carrier gas
Substrate Cromaton N-AW-DMCS
Column diameter (mm)
Phase thickness (μm)
Temperature (C) 170.
I 1928.
ReferenceSharif'yanova and Vigdergauz, 1981
Comment MSDC-RI

References

Sharif'yanova and Vigdergauz, 1981
Sharif'yanova, L.N.; Vigdergauz, M.S., Gas-chromatographic studies of aliphatic carboxylic-acid anilides, Zh. Anal. Khim., 1981, 36, 11, 1589-1593. [all data]