trans-2-Heptadecene

Kovats' RI, non-polar column, isothermal

View large format table.

Column type Active phase Temperature (C) I Reference Comment
CapillaryApolane160.1698.8Soják, Krupcík, et al., 1980N2 or H2; Column length: 250. m; Column diameter: 0.25 mm
CapillaryApiezon L154.1700.0Soják, Krupcík, et al., 1980N2 or H2; Column length: 250. m; Column diameter: 0.25 mm

Kovats' RI, polar column, isothermal

View large format table.

Column type Active phase Temperature (C) I Reference Comment
CapillaryPEG-20M110.1735.Rang, Orav, et al., 1988
CapillaryCarbowax 20M110.1735.Soják, Krupcík, et al., 1980N2; Column length: 300. m; Column diameter: 0.25 mm

Van Den Dool and Kratz RI, non-polar column, custom temperature program

View large format table.

Column type Active phase I Reference Comment
CapillaryDB-51708.Zaikin and Borisov, 2002He; Column length: 30. m; Column diameter: 0.25 mm; Program: 30C => 5K/min=120C => 10C/min => 270C

Normal alkane RI, non-polar column, temperature ramp

View large format table.

Column type Active phase I Reference Comment
CapillaryPetrocol DH1701.Sojak, Kubinec, et al., 2006150. m/0.25 mm/1.0 μm, 1. K/min; Tstart: 40. C; Tend: 300. C

References

Soják, Krupcík, et al., 1980
Soják, L.; Krupcík, J.; Janák, J., Gas chromatography of all C15-C18 linear alkenes on capillary columns with very high resolution power, J. Chromatogr., 1980, 195, 1, 43-64, https://doi.org/10.1016/S0021-9673(00)81542-3 . [all data]

Rang, Orav, et al., 1988
Rang, S.A.; Orav, A.E.; Kuningas, K.R.; Meister, A.E.; Strense, T.V.; Eisen, O.G., Gas-Chromatographic Characteristics of unsaturated hydrocarbons, Academy of Sciences of Estonia SSR, Tallinn, Estonia SSR, 1988, 208. [all data]

Zaikin and Borisov, 2002
Zaikin, V.G.; Borisov, R.S., Chromatographic-mass spectrometric analysis of Fishcer-Tropsch synthesis products, J. Anal. Chem. USSR (Engl. Transl.), 2002, 57, 6, 544-551. [all data]

Sojak, Kubinec, et al., 2006
Sojak, L.; Kubinec, R.; Jurdakova, H.; Hajekova, E.; Bajus, M., GC-MS of polyethylene and polypropylene thermal cracking produxts, Petroleum Coal, 2006, 48, 1, 1-14. [all data]