Silane, methoxy-, propyloxy-, dibutyloxy-

Kovats' RI, non-polar column, isothermal

View large format table.

Column type Active phase Temperature (C) I Reference Comment
CapillaryApiezon L160.1224.5Peetre, 1974Column length: 50. m; Column diameter: 0.25 mm

References

Peetre, 1974
Peetre, I.-B., Gas chromatographic investigation of organometallic compounds and their carbon analogues. II. Improved method for calculating retention indices of tetraalkoxysilanes, J. Chromatogr., 1974, 88, 2, 311-321, https://doi.org/10.1016/S0021-9673(00)83155-6 . [all data]