5-methyl-hexyl-cyclopropane

Kovats' RI, non-polar column, isothermal

View large format table.

Column type Active phase Temperature (C) I Reference Comment
CapillarySqualane80.977.29Schomburg and Dielmann, 1973Column length: 100. m; Column diameter: 0.25 mm
CapillarySqualane100.979.46Schomburg and Dielmann, 1973, 2Column length: 100. m; Column diameter: 0.25 mm
CapillarySqualane120.981.43Schomburg and Dielmann, 1973, 2Column length: 100. m; Column diameter: 0.25 mm
CapillarySqualane60.975.50Schomburg and Dielmann, 1973, 2Column length: 100. m; Column diameter: 0.25 mm
CapillarySqualane80.977.42Schomburg and Dielmann, 1973, 2Column length: 100. m; Column diameter: 0.25 mm
CapillarySqualane80.977.29Schomburg and Dielmann, 1973, 2Column length: 100. m; Column diameter: 0.25 mm

References

Schomburg and Dielmann, 1973
Schomburg, G.; Dielmann, G., Identification by means of retention parameters, J. Chromatogr. Sci., 1973, 11, 3, 151-159, https://doi.org/10.1093/chromsci/11.3.151 . [all data]

Schomburg and Dielmann, 1973, 2
Schomburg, G.; Dielmann, G., Use of retention increments for identification and correlation of saturated and unsaturated cyclopropane hydrocarbons by means of Kovats indices, Anal. Chem., 1973, 45, 9, 1647-1658, https://doi.org/10.1021/ac60331a021 . [all data]