Benzene, 1,2-dibutyl

Normal alkane RI, non-polar column, custom temperature program

Data compiled by: NIST Mass Spectrometry Data Center, William E. Wallace, director

Column type Capillary
Active phase Methyl Silicone
Column length (m)
Carrier gas
Substrate
Column diameter (mm)
Phase thickness (μm)
Program not specified
I 1370.
ReferenceBonchev, Mekenjan, et al., 1979
Comment MSDC-RI

References

Bonchev, Mekenjan, et al., 1979
Bonchev, D.; Mekenjan, Ov.; Protic, G.; Trinajstic, N., Application of Topological Indices to Gas Chromatographic Data: Calculation of the Retention Indices of Isomeric Alkylbenzenes, J. Chromatogr., 1979, 176, 2, 149-156, https://doi.org/10.1016/S0021-9673(00)85645-9 . [all data]