Methyl-p-chlorophenyldichlorosilane

Kovats' RI, non-polar column, isothermal

View large format table.

Column type Active phase Temperature (C) I Reference Comment
PackedPolymethylsiloxane, (PMS-20000)50.1323.7Ainshtein and Shulyatieva, 1972He, Chromosorb W; Column length: 2. m

References

Ainshtein and Shulyatieva, 1972
Ainshtein, A.A.; Shulyatieva, T.I., Retention indices of alkyl- and arylchlorosilanes, Zh. Anal. Khim., 1972, 27, 816-821. [all data]