α-Hydroxybehenic acid, HFB-Me

Normal alkane RI, non-polar column, temperature ramp

View large format table.

Column type Active phase I Reference Comment
PackedSE-302564.Horning, Casparrini, et al., 1969Gas Chrom P, 2. K/min; Column length: 3.7 m; Tstart: 145. C

References

Horning, Casparrini, et al., 1969
Horning, M.G.; Casparrini, G.; Horning, E.C., The use of gas phase analytical methods for the analysis of phospholipids, J. Chromatogr. Sci., 1969, 7, 5, 267-275, https://doi.org/10.1093/chromsci/7.5.267 . [all data]