1-Propanamine, 2-methyl, N,N-diethyl

Kovats' RI, non-polar column, isothermal

View large format table.

Column type Active phase Temperature (C) I Reference Comment
PackedApiezon100.793.Golovnya, Zhuravleva, et al., 1976Column length: 2.7 m

References

Golovnya, Zhuravleva, et al., 1976
Golovnya, R.V.; Zhuravleva, I.L.; Kapustin, Yu.P., Gas chromatographic separation of tertiary isoaliphatic amines on supports treated with trisodium phosphate, Zh. Anal. Khim., 1976, 31, 764-768. [all data]