S-Isopropyl-N,N-diethyldithiocarbamate

Kovats' RI, non-polar column, isothermal

View large format table.

Column type Active phase Temperature (C) I Reference Comment
CapillaryOV-101180.1461.Evans and Smith, 199410. m/0.32 mm/0.50 μm, He

References

Evans and Smith, 1994
Evans, M.B.; Smith, M.S., A Comparative Study of the Chromatography of Hydroxylated Dialkyldithiocarbamates as Models for Drug Metabolites, Chromatographia, 1994, 39, 3/4, 569-576, https://doi.org/10.1007/BF02268281 . [all data]