Undecane, 2,6,10-trimethyl

Kovats' RI, non-polar column, isothermal

View large format table.

Column type Active phase Temperature (C) I Reference Comment
CapillarySE-30200.1279.Shlyakhov, 1984
CapillarySE-30200.1275.Shlyakhov, 1984
Capillaryn-Dotriacontane200.1268.Shlyakhov, 1984
CapillaryApiezon L200.1260.Shlyakhov, 1984
PackedSE-30150.1273.Shlyakhov, Anvaer, et al., 1975
PackedSE-30200.1275.Shlyakhov, Anvaer, et al., 1975
PackedApiezon L130.1259.Shlyakhov, Anvaer, et al., 1975
PackedApiezon L150.1260.Shlyakhov, Anvaer, et al., 1975
CapillarySE-30100.1275.Shlyakhov, Koreshkova, et al., 1975
CapillaryApiezon L100.1260.Shlyakhov, Koreshkova, et al., 1975

Kovats' RI, non-polar column, custom temperature program

View large format table.

Column type Active phase I Reference Comment
CapillaryApiezon L1256.Shlyakhov, 1984Program: not specified
CapillaryApiezon L1259.Shlyakhov, 1984Program: not specified
CapillaryApiezon L1260.Shlyakhov, 1984Program: not specified
CapillaryApiezon L1261.Shlyakhov, 1984Program: not specified
CapillaryApiezon L1263.Shlyakhov, 1984Program: not specified

Van Den Dool and Kratz RI, non-polar column, temperature ramp

View large format table.

Column type Active phase I Reference Comment
CapillaryCross-Linked Methylsilicone1277.Khorasheh, Gray, et al., 19895. K/min; Tstart: 40. C; Tend: 300. C

Normal alkane RI, non-polar column, temperature ramp

View large format table.

Column type Active phase I Reference Comment
CapillaryApieson L1261.Albaigès, Borbón, et al., 1981He, Gas-Chrom Q, 6. K/min; Column length: 50. m; Column diameter: 0.25 mm; Tstart: 120. C; Tend: 280. C

Normal alkane RI, non-polar column, custom temperature program

View large format table.

Column type Active phase I Reference Comment
CapillarySqualane1263.Petrov, 1984Program: not specified

References

Shlyakhov, 1984
Shlyakhov, A.F., Gas chromatography in organic geochemistry, Nedra, Moscow, 1984, 221. [all data]

Shlyakhov, Anvaer, et al., 1975
Shlyakhov, A.F.; Anvaer, B.I.; Zolotareva, O.V.; Romina, N.N.; Novikova, N.V.; Koreshkova, R.I., On the possibility of group indentification of hydrocarbons by gas chromatography from temperature coefficients of retention indices, Zh. Anal. Khim., 1975, 30, 788-792. [all data]

Shlyakhov, Koreshkova, et al., 1975
Shlyakhov, A.F.; Koreshkova, R.I.; Telkova, M.S., Gas Chromatography of Isoprenoid Alkanes, J. Chromatogr., 1975, 104, 2, 337-349, https://doi.org/10.1016/S0021-9673(00)91857-0 . [all data]

Khorasheh, Gray, et al., 1989
Khorasheh, F.; Gray, M.R.; Selucky, M.L., Correlation for Kováts retention index of C9-C26 monoalkyl and polymethyl alkanes and alkenes, J. Chromatogr., 1989, 481, 1-16, https://doi.org/10.1016/S0021-9673(01)96747-0 . [all data]

Albaigès, Borbón, et al., 1981
Albaigès, J.; Borbón, J.; Gassiot, M., Gas chromatographic-mass spectrometric identification of geochemically significant isoalkane hydrocarbons, J. Chromatogr., 1981, 204, 491-498, https://doi.org/10.1016/S0021-9673(00)81696-9 . [all data]

Petrov, 1984
Petrov, A.A., Hydrocarbons of petroleum, Nauka (publishing house), Moscow, 1984, 263. [all data]