Propanoic acid, 3-chloro, (E)-3-hexenyl ester

Kovats' RI, non-polar column, isothermal

Data compiled by: NIST Mass Spectrometry Data Center, William E. Wallace, director

Column type CapillaryCapillaryCapillaryCapillaryCapillary
Active phase SE-30SE-30SE-30SE-30SE-30
Column length (m) 25.25.25.25.25.
Carrier gas
Substrate
Column diameter (mm) 0.330.330.330.330.33
Phase thickness (μm)
Temperature (C) 100.120.140.160.80.
I 1275.1272.1290.1293.1286.
ReferenceHaken and Korhonen, 1985Haken and Korhonen, 1985Haken and Korhonen, 1985Haken and Korhonen, 1985Haken and Korhonen, 1985
Comment MSDC-RI MSDC-RI MSDC-RI MSDC-RI MSDC-RI

References

Haken and Korhonen, 1985
Haken, J.K.; Korhonen, I.O.O., Gas-liquid chromatography of homologous esters. XXIX. Propanoyl and monochlorpropanoyl esters of lower saturated branched-chain and unsaturated alcohols, J. Chromatogr., 1985, 324, 343-353, https://doi.org/10.1016/S0021-9673(01)81333-9 . [all data]