1-Methyl-3-isoallylbenzene

Kovats' RI, non-polar column, isothermal

View large format table.

Column type Active phase Temperature (C) I Reference Comment
CapillarySE-3065.1102.3Svob and Deur-Siftar, 1974He; Column length: 25.5 m; Column diameter: 0.5 mm

References

Svob and Deur-Siftar, 1974
Svob, V.; Deur-Siftar, D., Kovats Retention Indices in the Identification of Alkylbenzene Degradation Products, J. Chromatogr., 1974, 91, 677-689, https://doi.org/10.1016/S0021-9673(01)97947-6 . [all data]