Ethyl methylaminodithiocarbamate

Kovats' RI, non-polar column, isothermal

View large format table.

Column type Active phase Temperature (C) I Reference Comment
CapillaryDC-200190.1450.Onuska and Boos, 1974
CapillaryDC-200195.1452.Onuska and Boos, 1974
CapillaryDC-200200.1454.Onuska and Boos, 1974
CapillaryApiezon L190.1465.Onuska and Boos, 1974
CapillaryApiezon L200.1472.Onuska and Boos, 1974
CapillaryApiezon L210.1479.Onuska and Boos, 1974

References

Onuska and Boos, 1974
Onuska, F.I.; Boos, W.R., Gas-Liquid Chromatography and Mass Fragmentography of S-n-Propyl N-Monoalkyl Dithiocarbamates, J. Chromatogr., 1974, 99, 291-299, https://doi.org/10.1016/S0021-9673(00)90863-X . [all data]