Cyclopentane, 3-methylpentyl

Kovats' RI, non-polar column, isothermal

View large format table.

Column type Active phase Temperature (C) I Reference Comment
CapillarySqualane100.1105.Dielmann, Schwengers, et al., 1974Column length: 100. m; Column diameter: 0.25 mm
CapillarySqualane120.1109.Dielmann, Schwengers, et al., 1974Column length: 100. m; Column diameter: 0.25 mm
CapillarySqualane80.1100.Dielmann, Schwengers, et al., 1974Column length: 100. m; Column diameter: 0.25 mm

References

Dielmann, Schwengers, et al., 1974
Dielmann, G.; Schwengers, D.; Schomburg, G., Gas-chromatographische Retentionsdaten und Strukture chemischer Verbindungen Gesättigte und ungesättigte alkylsubstituierte Cyclopentane und Methylcyclopentane, Chromatographia, 1974, 7, 5, 215-224, https://doi.org/10.1007/BF02321771 . [all data]