Disiloxane, hexaethyl-

Phase change data

Data compiled as indicated in comments:
BS - Robert L. Brown and Stephen E. Stein
DH - Eugene S. Domalski and Elizabeth D. Hearing

Reduced pressure boiling point

Tboil (K) Pressure (bar) Reference Comment
402.0.040PCR Inc., 1990BS

Enthalpy of fusion

ΔfusH (kJ/mol) Temperature (K) Reference Comment
21.400199.57Dzhafarov and Kuliev, 1986DH

Condensed phase thermochemistry data

Data compiled by: Eugene S. Domalski and Elizabeth D. Hearing

Quantity Value Units Method Reference Comment
liquid622.7J/mol*KN/ADzhafarov and Kuliev, 1986

Constant pressure heat capacity of liquid

Cp,liquid (J/mol*K) Temperature (K) Reference Comment
460.298.15Dzhafarov and Kuliev, 1986T = 4 to 300 K. Cp(c) = 51.15 + 1.4244T - 1.7x10-1T2 (80 to 170 K); Cp(liq) = 282.22 + 0.626T - 1.05x10-1T2 (200 to 300 K).

References

PCR Inc., 1990
PCR Inc., Research Chemicals Catalog 1990-1991, PCR Inc., Gainesville, FL, 1990, 1. [all data]

Dzhafarov and Kuliev, 1986
Dzhafarov, O.I.; Kuliev, A.M., Heat capacity and thermodynamic properties of disiloxanes, Dokl. Akad. Nauk. Azerb., 1986, SSR 42, 56-59. [all data]