2-Methoxy-1,3-cycloheptadiene

Reaction thermochemistry data

Data compiled by: Hussein Y. Afeefy, Joel F. Liebman, and Stephen E. Stein

Individual Reactions

2-Methoxy-1,3-cycloheptadiene = 1,3-Cycloheptadiene, 1-methoxy-

By formula: C8H12O = C8H12O

Quantity Value Units Method Reference Comment
Δr-7.8 ± 0.5kJ/molEqkTaskinen and Nummelin, 1986liquid phase; solvent: Cyclohexane; GLC

References

Taskinen and Nummelin, 1986
Taskinen, E.; Nummelin, K., Thermodynamics of vinyl ethers. 31. Isomer equilibria in some six- and seven-membered cyclic dienes, J. Org. Chem., 1986, 50, 4844-4847. [all data]