1,2-Propanediol, 3-chloro-

Phase change data

Data compiled as indicated in comments:
BS - Robert L. Brown and Stephen E. Stein
AC - William E. Acree, Jr., James S. Chickos

Quantity Value Units Method Reference Comment
Tboil486.2KN/AAldrich Chemical Company Inc., 1990BS

Enthalpy of vaporization

ΔvapH (kJ/mol) Temperature (K) Reference Comment
66.6358.Giles, Wilson, et al., 1996Based on data from 343. - 409. K.; AC

Condensed phase thermochemistry data

Data compiled by: Hussein Y. Afeefy, Joel F. Liebman, and Stephen E. Stein

Quantity Value Units Method Reference Comment
Δfliquid-525.1 ± 0.8kJ/molCcrBjellerup and Smith, 1954At 293 K
Quantity Value Units Method Reference Comment
Δcliquid-1679. ± 0.4kJ/molCcrBjellerup and Smith, 1954At 293 K
Δcliquid-1683.51 ± 0.97kJ/molCcbSmith and Schjdnberg, 1931Not corrected for CODATA value of ΔfH

References

Aldrich Chemical Company Inc., 1990
Aldrich Chemical Company Inc., Catalog Handbook of Fine Chemicals, Aldrich Chemical Company, Inc., Milwaukee WI, 1990, 1. [all data]

Giles, Wilson, et al., 1996
Giles, Neil F.; Wilson, Howard L.; Wilding, W. Vincent, Phase Equilibrium Measurements on Twelve Binary Mixtures, J. Chem. Eng. Data, 1996, 41, 6, 1223-1238, https://doi.org/10.1021/je960161b . [all data]