1,3-Benzodioxole-5-carboxylic acid

Phase change data

Data compiled by: William E. Acree, Jr., James S. Chickos

Quantity Value Units Method Reference Comment
Δsub117.2 ± 1.8kJ/molMEMatos, Monte, et al., 2004Based on data from 363. - 377. K.

Enthalpy of sublimation

ΔsubH (kJ/mol) Temperature (K) Method Reference Comment
113.6 ± 1.1370.MEMatos, Monte, et al., 2004Based on data from 363. - 377. K.

Enthalpy of fusion

ΔfusH (kJ/mol) Temperature (K) Reference
30.5501.6Matos, Monte, et al., 2004

References

Matos, Monte, et al., 2004
Matos, M. Agostinha R.; Monte, Manuel J.S.; Sousa, Clara C.S.; Almeida, Ana R.R.P.; Morais, Victor M.F., Thermodynamic study of sesamol, piperonyl alcohol, piperonylic acid and homopiperonylic acid: a combined experimental and theoretical investigation, Org. Biomol. Chem., 2004, 2, 6, 908, https://doi.org/10.1039/b400107a . [all data]