Butylparaben

Phase change data

Data compiled by: William E. Acree, Jr., James S. Chickos

Quantity Value Units Method Reference Comment
Δsub108.4 ± 0.8kJ/molGSPerlovich, Rodionov, et al., 2005Based on data from 320. - 333. K.

Enthalpy of fusion

ΔfusH (kJ/mol) Temperature (K) Reference
26.6341.8Giordano, Bettini, et al., 1999

References

Perlovich, Rodionov, et al., 2005
Perlovich, German L.; Rodionov, Sergey V.; Bauer-Brandl, Annette, Thermodynamics of solubility, sublimation and solvation processes of parabens, European Journal of Pharmaceutical Sciences, 2005, 24, 1, 25-33, https://doi.org/10.1016/j.ejps.2004.09.007 . [all data]

Giordano, Bettini, et al., 1999
Giordano, Ferdinando; Bettini, Ruggero; Donini, Cristina; Gazzaniga, Andrea; Caira, Mino R.; Zhang, Geoffrey G.Z.; Grant, David J.W., Physical properties of parabens and their mixtures: Solubility in water, thermal behavior, and crystal structures, J. Pharm. Sci., 1999, 88, 11, 1210-1216, https://doi.org/10.1021/js9900452 . [all data]