P-sec-amyl phenol

Reaction thermochemistry data

Data compiled by: Hussein Y. Afeefy, Joel F. Liebman, and Stephen E. Stein

Individual Reactions

4-(3-Pentyl)phenol = P-sec-amyl phenol

By formula: C11H16O = C11H16O

Quantity Value Units Method Reference Comment
Δr-0.7 ± 0.3kJ/molEqkNesterova, Pimerzin, et al., 1989liquid phase; Isomerization

O-sec-amylphenol = P-sec-amyl phenol

By formula: C11H16O = C11H16O

Quantity Value Units Method Reference Comment
Δr-4.6 ± 0.5kJ/molEqkNesterova, Pimerzin, et al., 1989liquid phase; Isomerization

References

Nesterova, Pimerzin, et al., 1989
Nesterova, T.N.; Pimerzin, A.A.; Rozhnov, A.M.; Karlina, T.N., Equilibria for the isomerization of (secondary-alkyl)phenols and cyclohexylphenols, J. Chem. Thermodyn., 1989, 21, 385-395. [all data]