2,4,6-Trichloroborazine

Phase change data

Data compiled by: William E. Acree, Jr., James S. Chickos

Enthalpy of vaporization

ΔvapH (kJ/mol) Temperature (K) Method Reference Comment
49.6 ± 0.2386.ILaubengayer and Scaife, 1966Based on data from 363. - 409. K.
47.8373.N/ABrown and Laubengayer, 1955Based on data from 360. - 386. K.

Enthalpy of sublimation

ΔsubH (kJ/mol) Temperature (K) Method Reference
70.5 ± 0.4303. - 353.ILaubengayer and Scaife, 1966
71.1313. - 357.N/ABrown and Laubengayer, 1955

References

Laubengayer and Scaife, 1966
Laubengayer, A.W.; Scaife, C.W.J., The Vapor Pressures and Some Thermodynamic Functions of B-Trifluoro-, B-Trichloro-, and B-Tribromoborazine., J. Chem. Eng. Data, 1966, 11, 2, 172-174, https://doi.org/10.1021/je60029a012 . [all data]

Brown and Laubengayer, 1955
Brown, Charles A.; Laubengayer, A.W., B-Trichloroborazole 1, J. Am. Chem. Soc., 1955, 77, 14, 3699-3700, https://doi.org/10.1021/ja01619a007 . [all data]