3-Hexyne, 2,5-dimethyl-

Gas phase ion energetics data

Data compiled by: Sharon G. Lias, Rhoda D. Levin, and Sherif A. Kafafi

Ionization energy determinations

IE (eV) Method Reference
9.171 ± 0.008PECarlier, Dubois, et al., 1975

References

Carlier, Dubois, et al., 1975
Carlier, P.; Dubois, J.E.; Masclet, P.; Mouvier, G., Spectres de photoelectrons des alcynes, J. Electron Spectrosc. Relat. Phenom., 1975, 7, 55. [all data]