N,N-Dimethyl-1-propanamine

Kovats' RI, non-polar column, isothermal

View large format table.

Column type Active phase Temperature (C) I Reference Comment
PackedApiezon L80.591.Zhuravleva, Golovnya, et al., 1981Chromosorb G AW (80-100 mesh); Column length: 2.7 m
PackedApiezon L80.597.Zhuravleva, Golovnya, et al., 1981Chromosorb G AW (80-100 mesh); Column length: 2.7 m
PackedApiezon100.597.Golovnya, Zhuravleva, et al., 1976Column length: 2.7 m

References

Zhuravleva, Golovnya, et al., 1981
Zhuravleva, I.L.; Golovnya, R.V.; Terenina, M.B.; Grigorieva, D.N., Gas chromatographic behaviour of some unsymmetrical tertiary amines, Zh. Anal. Khim., 1981, 36, 968-975. [all data]

Golovnya, Zhuravleva, et al., 1976
Golovnya, R.V.; Zhuravleva, I.L.; Kapustin, Yu.P., Gas chromatographic separation of tertiary isoaliphatic amines on supports treated with trisodium phosphate, Zh. Anal. Khim., 1976, 31, 764-768. [all data]