α-Isobutyldecalin

Condensed phase thermochemistry data

Data compiled by: Eugene S. Domalski and Elizabeth D. Hearing

Constant pressure heat capacity of liquid

Cp,liquid (J/mol*K) Temperature (K) Reference Comment
358.6313.Gudinowicz, Campbell, et al., 1963T = 313 to 483 K.

References

Gudinowicz, Campbell, et al., 1963
Gudinowicz, B.J.; Campbell, R.H.; Adams, J.S., Specific heat measurements of complex saturated hydrocarbons, J. Chem. Eng. Data, 1963, 8, 201-214. [all data]