2-Butanamine, N,N-dimethyl-

Phase change data

Data compiled by: Thermodynamics Research Center, NIST Boulder Laboratories, Chris Muzny director

Quantity Value Units Method Reference Comment
Tboil366.4KN/ACope, Lebel, et al., 1957Uncertainty assigned by TRC = 2. K

In addition to the Thermodynamics Research Center (TRC) data available from this site, much more physical and chemical property data is available from the following TRC products:

Gas phase ion energetics data

Data evaluated by: Edward P. Hunter and Sharon G. Lias

Quantity Value Units Method Reference Comment
Proton affinity (review)233.2kcal/molN/AHunter and Lias, 1998
Quantity Value Units Method Reference Comment
Gas basicity225.9kcal/molN/AHunter and Lias, 1998

References

Cope, Lebel, et al., 1957
Cope, A.C.; Lebel, N.A.; Lee, H.-H.; Moore, W.R., Amine oxides: III selective formation of olefins from unsymmetrical amine oxides and quaternary ammonium hydroxides, J. Am. Chem. Soc., 1957, 79, 4720. [all data]