1,3,5-Triazine, hexahydro-1,3,5-triphenyl-

Condensed phase thermochemistry data

Data compiled by: Hussein Y. Afeefy, Joel F. Liebman, and Stephen E. Stein

Quantity Value Units Method Reference Comment
Δfsolid  CcbKishore and Santhanalakshmi, 1983uncertain value: 352.7 ± 0.63 kJ/mol; Data origin uncertain
Quantity Value Units Method Reference Comment
Δcsolid  CcbKishore and Santhanalakshmi, 1983uncertain value: -11362. ± 11. kJ/mol; Data origin uncertain

References

Kishore and Santhanalakshmi, 1983
Kishore, K.; Santhanalakshmi, K.N., A thermochemical approach to the analysis of aniline-formaldehyde reactions, Thermochim. Acta, 1983, 64, 155-165. [all data]