Pyrazine, (2-phenylethyl)-

Van Den Dool and Kratz RI, non-polar column, temperature ramp

View large format table.

Column type Active phase I Reference Comment
CapillaryHP-11552.Zhang, Dorjpalam, et al., 199250. m/0.32 mm/1.5 μm, 2. K/min, 220. C @ 30. min; Tstart: 40. C

Van Den Dool and Kratz RI, polar column, temperature ramp

View large format table.

Column type Active phase I Reference Comment
CapillaryHP-Innowax2367.Adamiec, Rossner, et al., 200130. m/0.25 mm/0.25 μm, N2, 5. K/min; Tstart: 60. C; Tend: 220. C
CapillaryDB-Wax2351.Kunert-Kirchhoff and Baltes, 1990He, 40. C @ 5. min, 2. K/min; Column length: 60. m; Column diameter: 0.25 mm; Tend: 210. C

References

Zhang, Dorjpalam, et al., 1992
Zhang, Y.; Dorjpalam, B.; Ho, C.-T., Contribution of peptides to volatile formation in the Maillard reaction of casein hydrolysate with glucose, J. Agric. Food Chem., 1992, 40, 12, 2467-2471, https://doi.org/10.1021/jf00024a026 . [all data]

Adamiec, Rossner, et al., 2001
Adamiec, J.; Rossner, J.; Velisek, J.; Cejpek, K.; Savel, J., Minor Strecker degradation products of phenylalanine and phenylglycine, Eur. Food Res. Technol., 2001, 212, 2, 135-140, https://doi.org/10.1007/s002170000234 . [all data]

Kunert-Kirchhoff and Baltes, 1990
Kunert-Kirchhoff, J.; Baltes, W., Model reactions on roast arome formation. VII. Specific products of phenylalanine after cooking L-phenylalanine with D-glucose in a laboratory autoclave, Z. Lebensm. Unters. Forsch., 1990, 190, 1, 9-13, https://doi.org/10.1007/BF01188255 . [all data]