Salicyl alcohol

Gas phase ion energetics data

Data compiled by: Sharon G. Lias, Rhoda D. Levin, and Sherif A. Kafafi

Ionization energy determinations

IE (eV) Method Reference Comment
8.58PEEck, Schweig, et al., 1978Vertical value

References

Eck, Schweig, et al., 1978
Eck, V.; Schweig, A.; Vermeer, H., The ultraviolet photoelectron spectrum of o-benzoquinone methide, Tetrahedron Lett., 1978, 27, 2433. [all data]