Bis(4-methylbenzoyl)peroxide

Condensed phase thermochemistry data

Data compiled by: Hussein Y. Afeefy, Joel F. Liebman, and Stephen E. Stein

Quantity Value Units Method Reference Comment
Δfsolid-451.5 ± 7.9kJ/molCcbBreitenbach and Derkosch, 1951Reanalyzed by Cox and Pilcher, 1970, Original value = -450.6 kJ/mol
Quantity Value Units Method Reference Comment
Δcsolid-7845.4 ± 7.9kJ/molCcbBreitenbach and Derkosch, 1951Reanalyzed by Cox and Pilcher, 1970, Original value = -7845.0 kJ/mol; Corresponding Δfsolid = -451.54 kJ/mol (simple calculation by NIST; no Washburn corrections)

References

Breitenbach and Derkosch, 1951
Breitenbach, J.W.; Derkosch, J., Verbrennungswarmen von peroxyden und verwandten verbindungen sowie von polystrolen, Monatsh. Chem., 1951, 82, 177-179. [all data]

Cox and Pilcher, 1970
Cox, J.D.; Pilcher, G., Thermochemistry of Organic and Organometallic Compounds, Academic Press, New York, 1970, 1-636. [all data]