5-Methylsalicylic acid

Phase change data

Data compiled by: Thermodynamics Research Center, NIST Boulder Laboratories, Chris Muzny director

Quantity Value Units Method Reference Comment
Tfus422.KN/AKing, McWhirter, et al., 1945Uncertainty assigned by TRC = 4. K

In addition to the Thermodynamics Research Center (TRC) data available from this site, much more physical and chemical property data is available from the following TRC products:

References

King, McWhirter, et al., 1945
King, L.C.; McWhirter, M.; Barton, D.M., Reactions of Acetophenols with Iodine and Pyridine and the Preparation of Hydroxybenzoic Acids, J. Am. Chem. Soc., 1945, 67, 2089-92. [all data]