1-Norbornyl cyanide

Phase change data

Data compiled as indicated in comments:
ALS - Hussein Y. Afeefy, Joel F. Liebman, and Stephen E. Stein
DRB - Donald R. Burgess, Jr.

Quantity Value Units Method Reference Comment
Δsub61.9 ± 1.5kJ/molVMeier, Dogan, et al., 1987ALS
Δsub61.9kJ/molN/AMeier, Dogan, et al., 1987DRB

References

Meier, Dogan, et al., 1987
Meier, M.; Dogan, B.; Beckhaus, H.; Ruchardt, C., Heats of formation and heats of isomerization of isocyanides, New J. Chem., 1987, 11, 1-6. [all data]