2,5-Dimethyl-2-oxy-5-tert-butylperoxyhexane

Gas phase thermochemistry data

Data compiled by: Donald R. Burgess, Jr.

Quantity Value Units Method Reference Comment
Δfgas-620.6 ± 2.2kJ/molN/AVan Chin-Syan, Korotyuk, et al., 1983Value computed using ΔfHliquid° value of -695.9±2.2 kj/mol from Van Chin-Syan, Korotyuk, et al., 1983 and ΔvapH° value of 75.3±0.1 kj/mol from missing citation.

References

Van Chin-Syan, Korotyuk, et al., 1983
Van Chin-Syan, Y.Y.; Korotyuk, V.F.; Panchenko, Yu.V., Peroxide bond energy of some peroxides with mixed functional groups, Visn. L'viv. Politekh. Inst., 1983, 171, 21-22. [all data]